Target
Cathepsin K
Ligand
BDBM19502
Substrate
BDBM19480
Meas. Tech.
Enzyme Inhibition Assay
IC50
2003±n/a nM
Citation
 Gauthier, JYBlack, WCCourchesne, ICromlish, WDesmarais, SHoule, RLamontagne, SLi, CSMassé, FMcKay, DJOuellet, MRobichaud, JTruchon, JFTruong, VLWang, QPercival, MD The identification of potent, selective, and bioavailable cathepsin S inhibitors. Bioorg Med Chem Lett 17:4929-33 (2007)  
Target
Name:
Cathepsin K
Synonyms:
CATK_RABIT | CTSK
Type:
Enzyme
Mol. Mass.:
36879.51
Organism:
Oryctolagus cuniculus (rabbit)
Description:
Residue:
329
  
Inhibitor
Name:
BDBM19502
Synonyms:
(2R)-N-(1-cyanocyclopropyl)-3-(cyclopropylmethane)sulfonyl-2-{[(1S)-2,2,2-trifluoro-1-(4-fluorophenyl)ethyl]amino}propanamide | trifluoroethylamine inhibitor, 12
Type:
Small organic molecule
Emp. Form.:
C19H21F4N3O3S
Mol. Mass.:
447.447
SMILES:
Fc1ccc(cc1)[C@H](N[C@@H](CS(=O)(=O)CC1CC1)C(=O)NC1(CC1)C#N)C(F)(F)F
:
Substrate
Name:
BDBM19480
Synonyms:
Cbz-Leu-Arg-AMC Z-Leu-Arg-AMC
Type:
Emp. Form.:
Mol. Mass.:
SMILES:
: