Target
Procathepsin L
Ligand
BDBM19511
Substrate
BDBM19480
Meas. Tech.
Enzyme Inhibition Assay
IC50
23±n/a nM
Citation
 Gauthier, JYBlack, WCCourchesne, ICromlish, WDesmarais, SHoule, RLamontagne, SLi, CSMassé, FMcKay, DJOuellet, MRobichaud, JTruchon, JFTruong, VLWang, QPercival, MD The identification of potent, selective, and bioavailable cathepsin S inhibitors. Bioorg Med Chem Lett 17:4929-33 (2007)  
Target
Name:
Procathepsin L
Synonyms:
CATL1_HUMAN CTSL CTSL1 Cathepsin L Cathepsin L1 heavy chain MEP cathepsin L preproprotein
Type:
Enzyme
Mol. Mass.:
37557.19
Organism:
Homo sapiens (Human)
Description:
Purchased from Calbiochem (San Diego, CA).
Residue:
333
  
Inhibitor
Name:
BDBM19511
Synonyms:
(2R)-3-[(3-bromobenzene)sulfonyl]-N-(1-cyanocyclopropyl)-2-{[(1S)-2,2,2-trifluoro-1-phenylethyl]amino}propanamide | trifluoroethylamine inhibitor, 21
Type:
Small organic molecule
Emp. Form.:
C21H19BrF3N3O3S
Mol. Mass.:
530.358
SMILES:
FC(F)(F)[C@@H](N[C@@H](CS(=O)(=O)c1cccc(Br)c1)C(=O)NC1(CC1)C#N)c1ccccc1
:
Substrate
Name:
BDBM19480
Synonyms:
Cbz-Leu-Arg-AMC Z-Leu-Arg-AMC
Type:
Emp. Form.:
Mol. Mass.:
SMILES:
: