Target
C-X-C chemokine receptor type 2
Ligand
BDBM150812
Substrate
Meas. Tech.
FLIPR-3 Calcium Assay
IC50
22.0±2900 nM
Citation
 Maeda, DYZebala, JA Pyridinecarboxamides as CXCR2 modulators US Patent  USRE47267 Publication Date 3/5/2019 
Target
Name:
C-X-C chemokine receptor type 2
Synonyms:
C-X-C chemokine receptor type 2 (CXCR-2) CD_antigen=CD182 CXCR-2 CXCR2_HUMAN GRO/MGSA receptor IL-8 receptor type 2 IL8RB | Interleukin-8 receptor B
Type:
Protein
Mol. Mass.:
40767.88
Organism:
Homo sapiens (Human)
Description:
P25025
Residue:
360
  
Inhibitor
Name:
BDBM150812
Synonyms:
US8981106, 2 (SX-576) | USRE47267, Compound 2
Type:
Small organic molecule
Emp. Form.:
C20H15BF4N2O4S
Mol. Mass.:
466.214
SMILES:
OB(O)c1ccc(OC(F)(F)F)cc1CSc1ccc(cn1)C(=O)Nc1ccc(F)cc1
: