Target
Ectonucleotide pyrophosphatase/phosphodiesterase family member 2
Ligand
BDBM362951
Substrate
Meas. Tech.
Inhibition Assay
IC50
<500±n/a nM
Citation
 Hutchinson, JHLonergan, DHuang, FRowbottom, MCalderon, I Autotaxin inhibitor compounds US Patent  US9850203 Publication Date 12/26/2017 
Target
Name:
Ectonucleotide pyrophosphatase/phosphodiesterase family member 2
Synonyms:
ATX Autotaxin (ATX) ENPP2 Ectonucleotide Pyrophosphatase/Phosphodiesterase 2 (ENPP2) Extracellular lysophospholipase D PDNP2
Type:
Enzyme
Mol. Mass.:
99007.13
Organism:
Homo sapiens (Human)
Description:
Q13822
Residue:
863
  
Inhibitor
Name:
BDBM362951
Synonyms:
3-((6-Chloro-7-fluoro-2-methyl-1-(2-oxo-2-(2-oxo-7-azaspiro[3.5]nonan-7-yl)ethyl)-1H-indol-3-yl)thio)benzoic acid | US9850203, Compound 1-18
Type:
Small organic molecule
Emp. Form.:
C28H28ClFN2O4S
Mol. Mass.:
543.049
SMILES:
CCOC(=O)c1cccc(Sc2c(C)n(CC(=O)N3CCC4(CC(=O)C4)CC3)c3c(F)c(Cl)ccc23)c1
: