Target
Adenosine receptor A1
Ligand
BDBM21174
Substrate
BDBM21173
Meas. Tech.
Receptor Binding Assay
pH
7.4±n/a
Temperature
295.15±n/a K
Ki
220±30 nM
Citation
 Slee, DHChen, YZhang, XMoorjani, MLanier, MCLin, ERueter, JKWilliams, JPLechner, SMMarkison, SMalany, SSantos, MGross, RSJalali, KSai, YZuo, ZYang, CCastro-Palomino, JCCrespo, MIPrat, MGual, SDíaz, JLSaunders, J 2-Amino-N-pyrimidin-4-ylacetamides as A2A Receptor Antagonists: 1. Structure-Activity Relationships and Optimization of Heterocyclic Substituents. J Med Chem 51:1719-29 (2008)  
Target
Name:
Adenosine receptor A1
Synonyms:
A1 adenosine receptor (hA1) AA1R_HUMAN ADORA1 Adenosine A1-receptor Adenosine receptor A1 (hA1) | Adenosine transporter (AdT)
Type:
G Protein-Coupled Receptor (GPCR)
Mol. Mass.:
36520.92
Organism:
Homo sapiens (Human)
Description:
P30542
Residue:
326
  
Inhibitor
Name:
BDBM21174
Synonyms:
CHEMBL398272 Pyrimidine analogue, 26
Type:
Small organic molecule
Emp. Form.:
C18H20N6O2S
Mol. Mass.:
384.455
SMILES:
CN1CCN(CC(=O)Nc2cc(nc(n2)-c2ccco2)-c2nccs2)CC1
:
Substrate
Name:
BDBM21173
Synonyms:
1,3-dipropyl-8-cyclopentylxanthine CHEMBL183 PD116948 | [3H]DPCPX
Type:
radiolabeled ligand
Emp. Form.:
C16H24N4O2
Mol. Mass.:
304.3874
SMILES:
CCCn1c2nc([nH]c2c(=O)n(CCC)c1=O)C1CCCC1
: