Target
Translocator protein
Ligand
BDBM22038
Substrate
BDBM22032
Meas. Tech.
Radioligand Binding Assay
pH
7.4±n/a
Temperature
277.15±n/a K
Ki
0.37±0.13 nM
Citation
 Taliani, SSimorini, FSergianni, VLa Motta, CDa Settimo, FCosimelli, BAbignente, EGreco, GNovellino, ERossi, LGremigni, VSpinetti, FChelli, BMartini, C New fluorescent 2-phenylindolglyoxylamide derivatives as probes targeting the peripheral-type benzodiazepine receptor: design, synthesis, and biological evaluation. J Med Chem 50:404-7 (2007)  
Target
Name:
Translocator protein
Synonyms:
Benzodiazepine receptors; peripheral & central Mbr PBR Peripheral benzodiazepine receptor (PBR) TSPO_RAT | Tspo
Type:
Mitochondrion membrane protein
Mol. Mass.:
18945.84
Organism:
Rattus norvegicus (rat)
Description:
Competitive binding experiments were performed on rat kidney mitochondrial membranes.
Residue:
169
  
Inhibitor
Name:
BDBM22038
Synonyms:
2-[2-(4-fluorophenyl)-1H-indol-3-yl]-N,N-dihexyl-2-oxoacetamide | CHEMBL53430
Type:
Small organic molecule
Emp. Form.:
C28H35FN2O2
Mol. Mass.:
450.5881
SMILES:
CCCCCCN(CCCCCC)C(=O)C(=O)c1c([nH]c2ccccc12)-c1ccc(F)cc1
:
Substrate
Name:
BDBM22032
Synonyms:
1-(2-chlorophenyl)-N-methyl-N-(1-methylpropyl)isoquinoline-3-carboxamide N-(butan-2-yl)-1-(2-chlorophenyl)-N-methylisoquinoline-3-carboxamide PK-11195 RP 52028 | [3H]PK 11195
Type:
radiolabeled ligand
Emp. Form.:
C21H21ClN2O
Mol. Mass.:
352.857
SMILES:
CCC(C)N(C)C(=O)c1cc2ccccc2c(n1)-c1ccccc1Cl
: