Target
Kinesin-like protein KIF11
Ligand
BDBM23775
Substrate
BDBM2
Meas. Tech.
Inhibition of Eg5 ATPase Activity
pH
6.9±n/a
Temperature
295.15±n/a K
Ki
450±n/a nM
Citation
 Debonis, SSkoufias, DAIndorato, RLLiger, FMarquet, BLaggner, CJoseph, BKozielski, F Structure-activity relationship of S-trityl-L-cysteine analogues as inhibitors of the human mitotic kinesin Eg5. J Med Chem 51:1115-25 (2008)  
Target
Name:
Kinesin-like protein KIF11
Synonyms:
EG5 KIF11_HUMAN Kinesin Spindle Protein Eg5 TRIP5 | kinesin spindle protein
Type:
PROTEIN
Mol. Mass.:
119138.97
Organism:
Homo sapiens (Human)
Description:
ChEMBL_1457426
Residue:
1056
  
Inhibitor
Name:
BDBM23775
Synonyms:
(2R)-2-amino-3-[(1,1-diphenylpropyl)sulfanyl]propanoic acid | S-Trityl-L-Cysteine (STLC) Analogue, 4
Type:
Small organic molecule
Emp. Form.:
C18H21NO2S
Mol. Mass.:
315.43
SMILES:
CCC(SC[C@H](N)C(O)=O)(c1ccccc1)c1ccccc1
:
Substrate
Name:
BDBM2
Synonyms:
({[({[(2R,3S,4R,5R)-5-(6-amino-9H-purin-9-yl)-3,4-dihydroxyoxolan-2-yl]methoxy}(hydroxy)phosphoryl)oxy](hydroxy)phosphoryl}oxy)phosphonic acid Brimonidine ATP | CHEMBL14249
Type:
Nucleoside or nucleotide
Emp. Form.:
C10H16N5O13P3
Mol. Mass.:
507.181
SMILES:
Nc1ncnc2n(cnc12)[C@@H]1O[C@H](COP(O)(=O)OP(O)(=O)OP(O)(O)=O)[C@@H](O)[C@H]1O
: