Target
Bifunctional purine biosynthesis protein ATIC
Ligand
BDBM24688
Substrate
BDBM22579
Meas. Tech.
AICAR Tfase Inhibition Assay
pH
7.4±n/a
Temperature
299.15±n/a K
Ki
>100000±n/a nM
Citation
 DeMartino, JKHwang, IConnelly, SWilson, IABoger, DL Asymmetric synthesis of inhibitors of glycinamide ribonucleotide transformylase. J Med Chem 51:5441-8 (2008)  
Target
Name:
Bifunctional purine biosynthesis protein ATIC
Synonyms:
5-aminoimidazole-4-carboxamide ribonucleotide formyltransferase AICAR Tfase ATIC Bifunctional purine biosynthesis protein PURH IMP cyclohydrolase Inosinicase PURH Thymidylate synthase/GAR transformylase/AICAR transformylase
Type:
Protein
Mol. Mass.:
64616.62
Organism:
Homo sapiens (Human)
Description:
P31939
Residue:
592
  
Inhibitor
Name:
BDBM24688
Synonyms:
10-hydroxy-DDACTHF, 10S-7 | 2-({4-[(1S)-4-(2,4-diamino-6-oxo-1,6-dihydropyrimidin-5-yl)-1-hydroxybutyl]phenyl}formamido)pentanedioic acid
Type:
Small organic molecule
Emp. Form.:
C20H25N5O7
Mol. Mass.:
447.4418
SMILES:
Nc1nc(N)c(CCC[C@H](O)c2ccc(cc2)C(=O)NC(CCC(O)=O)C(O)=O)c(=O)[nH]1
:
Substrate
Name:
BDBM22579
Synonyms:
AICAR CHEMBL483849 {[(2R,3S,4R,5R)-5-(5-amino-4-carbamoyl-1H-imidazol-1-yl)-3,4-dihydroxyoxolan-2-yl]methoxy}phosphonic acid
Type:
Nucleoside or nucleotide
Emp. Form.:
C9H15N4O8P
Mol. Mass.:
338.2112
SMILES:
NC(=O)c1ncn([C@@H]2O[C@H](COP(O)(O)=O)[C@@H](O)[C@H]2O)c1N
: