Target
Histone deacetylase 1
Ligand
BDBM25168
Substrate
BDBM25143
Meas. Tech.
HDAC Activity Assay
pH
8±n/a
Temperature
310.15±n/a K
IC50
6±n/a nM
Citation
 Jones, PBottomley, MJCarfí, ACecchetti, OFerrigno, FLo Surdo, POntoria, JMRowley, MScarpelli, RSchultz-Fademrecht, CSteinkühler, C 2-Trifluoroacetylthiophenes, a novel series of potent and selective class II histone deacetylase inhibitors. Bioorg Med Chem Lett 18:3456-61 (2008)  
Target
Name:
Histone deacetylase 1
Synonyms:
Cereblon/Histone deacetylase 1 HDAC1 Histone deacetylase 1 (HDAC1) RPD3L1
Type:
Enzyme
Mol. Mass.:
55090.27
Organism:
Homo sapiens (Human)
Description:
Q13547
Residue:
482
  
Inhibitor
Name:
BDBM25168
Synonyms:
2-N-hydroxy-5-N-[(1R)-1-phenylethyl]thiophene-2,5-dicarboxamide | thiophene derivative, 8d
Type:
Small organic molecule
Emp. Form.:
C14H14N2O3S
Mol. Mass.:
290.338
SMILES:
C[C@@H](NC(=O)c1ccc(s1)C(=O)NO)c1ccccc1
:
Substrate
Name:
BDBM25143
Synonyms:
Fluor-de-Lys Fluorogenic Deacetylase Substrate | KI-104 (BioMol Research Laboratories)
Type:
Fluorogenic Substrate
Emp. Form.:
Mol. Mass.:
SMILES:
: