Target
Transthyretin
Ligand
BDBM138357
Substrate
Meas. Tech.
The FP assay
IC50
277±n/a nM
Citation
 Graef, IAAlhamadsheh, MM Identification of stabilizers of multimeric proteins US Patent  US10278929 Publication Date 5/7/2019 
Target
Name:
Transthyretin
Synonyms:
ATTR Prealbumin TTHY_HUMAN Transthyretin (TTR)
Type:
Enzyme
Mol. Mass.:
15884.31
Organism:
Homo sapiens (Human)
Description:
P02766
Residue:
147
  
Inhibitor
Name:
BDBM138357
Synonyms:
US10278929, Compound 6 US8877795, 6
Type:
Small organic molecule
Emp. Form.:
C11H9F3N4O2S
Mol. Mass.:
318.275
SMILES:
COc1ccc(\C=N\n2c(S)nnc2C(F)(F)F)cc1O
: