Target
Steroid 17-alpha-hydroxylase/17,20 lyase
Ligand
BDBM25443
Substrate
BDBM8903
Meas. Tech.
CYP17 Inhibition Assay
pH
7.4±n/a
Temperature
310.15±n/a K
IC50
423±n/a nM
Citation
 Pinto-Bazurco Mendieta, MANegri, MJagusch, CMüller-Vieira, ULauterbach, THartmann, RW Synthesis, biological evaluation, and molecular modeling of abiraterone analogues: novel CYP17 inhibitors for the treatment of prostate cancer. J Med Chem 51:5009-18 (2008)  
Target
Name:
Steroid 17-alpha-hydroxylase/17,20 lyase
Synonyms:
CP17A_HUMAN CYP17A1 Cytochrome P450 17A1 Cytochrome P450 C17 (CYP17) Cytochrome P450-C17 P450-C17 Steroid 17-alpha-Monooxygenase (CYP17) Steroid 17-alpha-monooxygenase | cytochrome P450 monooxygenase 17 alpha hydroxylase/17,20-lyase (CYP17)
Type:
Enzyme
Mol. Mass.:
57382.42
Organism:
Homo sapiens (Human)
Description:
E.coli expressing human CYP17
Residue:
508
  
Inhibitor
Name:
BDBM25443
Synonyms:
6-(3,4-difluorophenyl)-1-(pyridin-4-yl)-1,2,3,4-tetrahydronaphthalen-1-ol | Abiraterone mimetic, 6
Type:
Small organic molecule
Emp. Form.:
C21H17F2NO
Mol. Mass.:
337.3626
SMILES:
OC1(CCCc2cc(ccc12)-c1ccc(F)c(F)c1)c1ccncc1
:
Substrate
Name:
BDBM8903
Synonyms:
(1S,2R,10S,11S,14S,15S)-14-acetyl-2,15-dimethyltetracyclo[8.7.0.0^{2,7}.0^{11,15}]heptadec-6-en-5-one progesterone
Type:
Steroid
Emp. Form.:
C21H30O2
Mol. Mass.:
314.4617
SMILES:
[H][C@@]12CC[C@H](C(C)=O)[C@@]1(C)CC[C@@]1([H])[C@@]2([H])CCC2=CC(=O)CC[C@]12C
: