Target
Tyrosine-protein kinase ZAP-70
Ligand
BDBM26411
Substrate
ZAP-70 Peptide Substrate
Meas. Tech.
Intracellular ZAP-70 Kinase Inhibition Assay
pH
7.6±n/a
Temperature
303.15±n/a K
IC50
230±n/a nM
Citation
 Hirabayashi, AMukaiyama, HKobayashi, HShiohara, HNakayama, SOzawa, MMiyazawa, KMisawa, KOhnota, HIsaji, M Structure-activity relationship studies of 5-benzylaminoimidazo[1,2-c]pyrimidine-8-carboxamide derivatives as potent, highly selective ZAP-70 kinase inhibitors. Bioorg Med Chem 17:284-94 (2009)  
Target
Name:
Tyrosine-protein kinase ZAP-70
Synonyms:
70 kDa zeta-associated protein Syk-related tyrosine kinase Tyrosine-protein kinase ZAP-70 Tyrosine-protein kinase ZAP-70 (ZAP70) ZAP70 Zeta-chain (TCR) associated protein kinase 70kDa
Type:
Enzyme
Mol. Mass.:
69881.61
Organism:
Homo sapiens (Human)
Description:
ZAP-70 SH2 domain was expressed and purified from E. coli using O-phospho-L-tyrosine-agarose column.
Residue:
619
  
Inhibitor
Name:
BDBM26411
Synonyms:
7-[(3,5-dimethoxyphenyl)amino]-5-{[(4-methoxyphenyl)methyl]amino}imidazo[1,2-a]pyrimidine-8-carboxamide | imidazo[1,2-c]pyrimidine-8-carboxamide, 10j
Type:
Small organic molecule
Emp. Form.:
C23H24N6O4
Mol. Mass.:
448.4745
SMILES:
COc1ccc(CNc2nc(Nc3cc(OC)cc(OC)c3)c(C(N)=O)c3nccn23)cc1
:
Substrate
Name:
ZAP-70 Peptide Substrate
Synonyms:
Syk Peptide Substrate
Type:
Peptide
Mol. Mass.:
1797.98
Organism:
Description:
Residue:
15
AEEEIYGEFEAKKKK