Target
Tyrosine-protein kinase ZAP-70
Ligand
BDBM26417
Substrate
ZAP-70 Peptide Substrate
Meas. Tech.
Intracellular ZAP-70 Kinase Inhibition Assay
pH
7.6±n/a
Temperature
303.15±n/a K
IC50
920±n/a nM
Citation
 Hirabayashi, AMukaiyama, HKobayashi, HShiohara, HNakayama, SOzawa, MMiyazawa, KMisawa, KOhnota, HIsaji, M Structure-activity relationship studies of 5-benzylaminoimidazo[1,2-c]pyrimidine-8-carboxamide derivatives as potent, highly selective ZAP-70 kinase inhibitors. Bioorg Med Chem 17:284-94 (2009)  
Target
Name:
Tyrosine-protein kinase ZAP-70
Synonyms:
70 kDa zeta-associated protein Syk-related tyrosine kinase Tyrosine-protein kinase ZAP-70 Tyrosine-protein kinase ZAP-70 (ZAP70) ZAP70 Zeta-chain (TCR) associated protein kinase 70kDa
Type:
Enzyme
Mol. Mass.:
69881.61
Organism:
Homo sapiens (Human)
Description:
ZAP-70 SH2 domain was expressed and purified from E. coli using O-phospho-L-tyrosine-agarose column.
Residue:
619
  
Inhibitor
Name:
BDBM26417
Synonyms:
7-[(3,5-dimethoxyphenyl)amino]-5-[(furan-2-ylmethyl)amino]imidazo[1,2-a]pyrimidine-8-carboxamide | imidazo[1,2-c]pyrimidine-8-carboxamide, 10p
Type:
Small organic molecule
Emp. Form.:
C20H20N6O4
Mol. Mass.:
408.4106
SMILES:
COc1cc(Nc2nc(NCc3ccco3)n3ccnc3c2C(N)=O)cc(OC)c1
:
Substrate
Name:
ZAP-70 Peptide Substrate
Synonyms:
Syk Peptide Substrate
Type:
Peptide
Mol. Mass.:
1797.98
Organism:
Description:
Residue:
15
AEEEIYGEFEAKKKK