Target
Tyrosine-protein kinase ZAP-70
Ligand
BDBM26429
Substrate
ZAP-70 Peptide Substrate
Meas. Tech.
Intracellular ZAP-70 Kinase Inhibition Assay
pH
7.6±n/a
Temperature
303.15±n/a K
IC50
47±n/a nM
Citation
 Hirabayashi, AMukaiyama, HKobayashi, HShiohara, HNakayama, SOzawa, MMiyazawa, KMisawa, KOhnota, HIsaji, M Structure-activity relationship studies of 5-benzylaminoimidazo[1,2-c]pyrimidine-8-carboxamide derivatives as potent, highly selective ZAP-70 kinase inhibitors. Bioorg Med Chem 17:284-94 (2009)  
Target
Name:
Tyrosine-protein kinase ZAP-70
Synonyms:
70 kDa zeta-associated protein Syk-related tyrosine kinase Tyrosine-protein kinase ZAP-70 Tyrosine-protein kinase ZAP-70 (ZAP70) ZAP70 Zeta-chain (TCR) associated protein kinase 70kDa
Type:
Enzyme
Mol. Mass.:
69881.61
Organism:
Homo sapiens (Human)
Description:
ZAP-70 SH2 domain was expressed and purified from E. coli using O-phospho-L-tyrosine-agarose column.
Residue:
619
  
Inhibitor
Name:
BDBM26429
Synonyms:
(2E)-3-{4-[({8-carbamoyl-7-[(3,5-dimethoxyphenyl)amino]imidazo[1,2-a]pyrimidin-5-yl}amino)methyl]phenyl}prop-2-enoic acid imidazo[1,2-c]pyrimidine-8-carboxamide, 27
Type:
Small organic molecule
Emp. Form.:
C25H24N6O5
Mol. Mass.:
488.4953
SMILES:
COc1cc(Nc2nc(NCc3ccc(\C=C\C(O)=O)cc3)n3ccnc3c2C(N)=O)cc(OC)c1
:
Substrate
Name:
ZAP-70 Peptide Substrate
Synonyms:
Syk Peptide Substrate
Type:
Peptide
Mol. Mass.:
1797.98
Organism:
Description:
Residue:
15
AEEEIYGEFEAKKKK