Target
Gag-Pol polyprotein [588-1027,V694A]/[588-1147,V694A]
Ligand
BDBM27581
Substrate
poly(rA)/oligo(dT)
Meas. Tech.
Reverse Transcriptase Assay
Ki
1800±n/a nM
Citation
 Butini, SBrindisi, MCosconati, SMarinelli, LBorrelli, GCoccone, SSRamunno, ACampiani, GNovellino, EZanoli, SSamuele, AGiorgi, GBergamini, AMattia, MDLalli, SGalletti, BGemma, SMaga, G Specific Targeting of Highly Conserved Residues in the HIV-1 Reverse Transcriptase Primer Grip Region. 2. Stereoselective Interaction to Overcome the Effects of Drug Resistant Mutations. J Med Chem 52:1224-8 (2009)  
Target
Name:
Gag-Pol polyprotein [588-1027,V694A]/[588-1147,V694A]
Synonyms:
HIV-1 Reverse Transcriptase Mutant (V106A)
Type:
Protein Complex
Mol. Mass.:
Description:
Components:
This complex has 2 components.
Component 1
Name:
Gag-Pol polyprotein [588-1147,V694A]
Synonyms:
HIV-1 Reverse Transcriptase Mutant (V106A) Chain A gag-pol
Type:
Enzyme Subunit
Mol. Mass.:
64458.36
Organism:
Human immunodeficiency virus type 1
Description:
P04585[588-1147,V694A]
Residue:
560
  
Component 2
Name:
Gag-Pol polyprotein [588-1027,V694A]
Synonyms:
HIV-1 Reverse Transcriptase Mutant (V106A) Chain B gag-pol
Type:
Enzyme Subunit
Mol. Mass.:
51309.07
Organism:
Human immunodeficiency virus type 1
Description:
P04585[588-1027,V694A]
Residue:
440
  
Inhibitor
Name:
BDBM27581
Synonyms:
8-ethyl-8-[4-(phenoxymethyl)phenyl]-9-oxa-2,14-diazatricyclo[8.4.0.0^{2,6}]tetradeca-1(14),3,5,10,12-pentaen-7-one | Pyrrolopyridooxazepinone (PPO), 6
Type:
Small organic molecule
Emp. Form.:
C26H22N2O3
Mol. Mass.:
410.4645
SMILES:
CCC1(Oc2cccnc2-n2cccc2C1=O)c1ccc(COc2ccccc2)cc1
:
Substrate
Name:
poly(rA)/oligo(dT)
Synonyms:
Type:
RNA/DNA duplex
Mol. Mass.:
358.43
Organism:
Description:
[3H]-dTTP is co-substrate.
Residue:
3
NA