Target
Histone-arginine methyltransferase CARM1
Ligand
BDBM27654
Substrate
Histone H3
Meas. Tech.
Inhibition of CARM-1 Enzymatic Activity
pH
9±n/a
Temperature
295.15±n/a K
IC50
2310±n/a nM
Citation
 Allan, MManku, STherrien, ENguyen, NStyhler, SRobert, MFGoulet, ACPetschner, AJRahil, GRobert Macleod, ADéziel, RBesterman, JMNguyen, HWahhab, A N-Benzyl-1-heteroaryl-3-(trifluoromethyl)-1H-pyrazole-5-carboxamides as inhibitors of co-activator associated arginine methyltransferase 1 (CARM1). Bioorg Med Chem Lett 19:1218-23 (2009)  
Target
Name:
Histone-arginine methyltransferase CARM1
Synonyms:
CARM1_MOUSE Coactivator-associated arginine methyltransferase 1 Prmt4 | Protein arginine N-methyltransferase 4
Type:
Homodimer; chromatin regulator; methyltransferase
Mol. Mass.:
65855.95
Organism:
Mus musculus (mouse)
Description:
Assays were using N-terminal His-tagged, recombinant mouse CARM1 (expressed in Sf9 cells and purified using Ni-NTA agarose chromatography).
Residue:
608
  
Inhibitor
Name:
BDBM27654
Synonyms:
1-(5-{[(2S)-2-aminopropanamido]methyl}thiophen-2-yl)-N-[(2-fluorophenyl)methyl]-3-(trifluoromethyl)-1H-pyrazole-5-carboxamide | pyrazole scaffold, 10b
Type:
Small organic molecule
Emp. Form.:
C20H19F4N5O2S
Mol. Mass.:
469.456
SMILES:
C[C@H](N)C(=O)NCc1ccc(s1)-n1nc(cc1C(=O)NCc1ccccc1F)C(F)(F)F
:
Substrate
Name:
Histone H3
Synonyms:
H3-143 H3-B H3.2 H3.2-614 H3.2-616 H3b H3f Hist1h3c Hist1h3e Hist2h3b Hist2h3c2 Hist2h3ca2
Type:
Other Protein Type
Mol. Mass.:
15409.01
Organism:
Mus musculus (mouse)
Description:
Tritiated S-Adenosyl-Methionine (SAM) was used as a methyl donor co-factor.
Residue:
136