Target
Peroxisome proliferator-activated receptor alpha
Ligand
BDBM28759
Substrate
BDBM10852
Meas. Tech.
Cell-Based Transcription Assay
EC50
260±60 nM
Comments
120 +/- 11 % of maximal activation compared to Wy 14,643 normalized to 100%.
Citation
 Montanari, RSaccoccia, FScotti, ECrestani, MGodio, CGilardi, FLoiodice, FFracchiolla, GLaghezza, ATortorella, PLavecchia, ANovellino, EMazza, FAschi, MPochetti, G Crystal structure of the peroxisome proliferator-activated receptor gamma (PPARgamma) ligand binding domain complexed with a novel partial agonist: a new region of the hydrophobic pocket could be exploited for drug design. J Med Chem 51:7768-76 (2008)  
Target
Name:
Peroxisome proliferator-activated receptor alpha
Synonyms:
Nr1c1 PPAR-alpha Peroxisome Proliferator-Activated Receptor alpha Ppara
Type:
PROTEIN
Mol. Mass.:
52343.28
Organism:
Mus musculus
Description:
ChEMBL_572395
Residue:
468
  
Inhibitor
Name:
BDBM28759
Synonyms:
(2S)-3-phenyl-2-(4-phenylphenoxy)propanoic acid LT175 (S-1)
Type:
Small organic molecule
Emp. Form.:
C21H18O3
Mol. Mass.:
318.3658
SMILES:
OC(=O)[C@H](Cc1ccccc1)Oc1ccc(cc1)-c1ccccc1
:
Substrate