Target
Cytochrome P450 3A4
Ligand
BDBM50265951
Substrate
Meas. Tech.
Inhibition Assay
IC50
3150±n/a nM
Citation
 Diaz, PIsoherranen, NButtrick, BGuilloteau, N Specific inhibitors of cytochrome P450 26 retinoic acid hydroxylase US Patent  US9963439 Publication Date 5/8/2018 
Target
Name:
Cytochrome P450 3A4
Synonyms:
Albendazole monooxygenase CP3A4_HUMAN CYP3A4 CYPIIIA4 Cytochrome P450 3A4 (CYP3A4) Nifedipine oxidase Taurochenodeoxycholate 6-alpha-hydroxylase
Type:
Enzyme
Mol. Mass.:
57349.57
Organism:
Homo sapiens (Human)
Description:
Residue:
503
  
Inhibitor
Name:
BDBM50265951
Synonyms:
CHEMBL1657 US9963439, Tazarotene | ethyl 6-[(4,4-dimethyl-3,4-dihydro-2H-thiochromen-6-yl)ethynyl]nicotinate
Type:
Small organic molecule
Emp. Form.:
C21H21NO2S
Mol. Mass.:
351.462
SMILES:
CCOC(=O)c1ccc(nc1)C#Cc1ccc2SCCC(C)(C)c2c1
: