Target
Ribosyldihydronicotinamide dehydrogenase [quinone]
Ligand
BDBM29214
Substrate
BDBM29211
Meas. Tech.
QR2 Assay and IC50 Value Determination
pH
7.5±n/a
Temperature
296.15±n/a K
IC50
>500000±n/a nM
Citation
 Maiti, AReddy, PVSturdy, MMarler, LPegan, SDMesecar, ADPezzuto, JMCushman, M Synthesis of casimiroin and optimization of its quinone reductase 2 and aromatase inhibitory activities. J Med Chem 52:1873-84 (2009)  
Target
Name:
Ribosyldihydronicotinamide dehydrogenase [quinone]
Synonyms:
Metallothionein-3 NQO2 NRH dehydrogenase [quinone] 2 QR2 Quinone reductase 2 (NQO2) | Ribosyldihydronicotinamide dehydrogenase [quinone]
Type:
Protein
Mol. Mass.:
25917.25
Organism:
Homo sapiens (Human)
Description:
P16083
Residue:
231
  
Inhibitor
Name:
BDBM29214
Synonyms:
casimiroin analogue, 1c | cid_69088
Type:
Small organic molecule
Emp. Form.:
C10H9NO
Mol. Mass.:
159.1846
SMILES:
Cc1cc(=O)[nH]c2ccccc12
:
Substrate
Name:
BDBM29211
Synonyms:
N-methyldihydronicotinamide | NMeH
Type:
Small organic molecule
Emp. Form.:
C18H16N5S
Mol. Mass.:
334.418
SMILES:
Cc1nc(sc1C)-[n+]1nc(nn1-c1ccccc1)-c1ccccc1
: