Target
Cathepsin D
Ligand
BDBM26502
Substrate
Fluorescent Substrate
Meas. Tech.
Enzyme Inhibition Assay
IC50
6760±n/a nM
Citation
 Charrier, NClarke, BDemont, EDingwall, CDunsdon, RHawkins, JHubbard, JHussain, IMaile, GMatico, RMosley, JNaylor, AO'Brien, ARedshaw, SRowland, PSoleil, VSmith, KJSweitzer, STheobald, PVesey, DWalter, DSWayne, G Second generation of BACE-1 inhibitors part 2: Optimisation of the non-prime side substituent. Bioorg Med Chem Lett 19:3669-73 (2009)  
Target
Name:
Cathepsin D
Synonyms:
CATD_HUMAN CTSD Cathepsin D heavy chain Cathepsin D precursor
Type:
Enzyme
Mol. Mass.:
44551.72
Organism:
Homo sapiens (Human)
Description:
Human proCathepsin D (SwissProt accession number P07339) was expressed in Sf9 cells, purified, and autoactivated.
Residue:
412
  
Inhibitor
Name:
BDBM26502
Synonyms:
3-(1,1-dioxo-1,2-thiazinan-2-yl)-5-(ethylamino)-N-[(2S,3R)-3-hydroxy-1-phenyl-4-({[3-(trifluoromethyl)phenyl]methyl}amino)butan-2-yl]benzamide BMCL193664 Compound 24 BMCL193669 Compound 8 | sultam hydroxyethylamine (HEA) derivative, 1
Type:
Small organic molecule
Emp. Form.:
C31H37F3N4O4S
Mol. Mass.:
618.71
SMILES:
CCNc1cc(cc(c1)C(=O)N[C@@H](Cc1ccccc1)[C@H](O)CNCc1cccc(c1)C(F)(F)F)N1CCCCS1(=O)=O
:
Substrate
Name:
Fluorescent Substrate
Synonyms:
Type:
Peptide
Mol. Mass.:
2030.30
Organism:
Description:
Residue:
18
FAMSEVNLDAEFKTAMRA