Target
Mitogen-activated protein kinase kinase kinase kinase 1
Ligand
BDBM283464
Substrate
Meas. Tech.
In Vitro Enzyme Inhibition
IC50
<100±n/a nM
Citation
 McDonald, AQian, S Therapeutic inhibitory compounds US Patent  US10308637 Publication Date 6/4/2019 
Target
Name:
Mitogen-activated protein kinase kinase kinase kinase 1
Synonyms:
HPK1 MAP4K1
Type:
PROTEIN
Mol. Mass.:
91316.07
Organism:
Homo sapiens (Human)
Description:
ChEMBL_586597
Residue:
833
  
Inhibitor
Name:
BDBM283464
Synonyms:
N-((3-chloro-6-fluoro-1H-indol-5-yl)methyl)-2- ((6-methylquinolin-3-yl)methyl)isonicotinamide US10266515, Example 116 US11021463, Example 116 | US9611252, Example 116
Type:
Small organic molecule
Emp. Form.:
C26H20ClFN4O
Mol. Mass.:
458.915
SMILES:
Cc1ccc2ncc(Cc3cc(ccn3)C(=O)NCc3cc4c(Cl)c[nH]c4cc3F)cc2c1
: