Target
Sphingosine 1-phosphate receptor 2
Ligand
BDBM399291
Substrate
Meas. Tech.
TBD
IC50
43200±n/a nM
Citation
 Roberts, ERosen, HUrbano, MGuerrero, MA Sphinogosine-1-phosphate receptor modulators for treatment of cardiopulmonary disorders US Patent  US10323029 Publication Date 6/18/2019 
Target
Name:
Sphingosine 1-phosphate receptor 2
Synonyms:
EDG5 S1PR2 Sphingosine 1-phosphate receptor Sphingosine-1-phosphate receptor 2 | ndothelial differentiation G-protein coupled receptor 5
Type:
G Protein-Coupled Receptor (GPCR)
Mol. Mass.:
38883.16
Organism:
Homo sapiens (Human)
Description:
Membranes isolated from S1P2-transfected CHO cells were used in ligand binding assay.
Residue:
353
  
Inhibitor
Name:
BDBM399291
Synonyms:
US10323029, Generic formula 52597 IB | US11034691, CYM generic formula 52597 IB
Type:
Small organic molecule
Emp. Form.:
C20H14Cl3FN2O
Mol. Mass.:
423.695
SMILES:
Cc1cc(ccc1Cl)C(=O)N[C@@H](c1ccc(Cl)cc1)c1ncc(Cl)cc1F
: