Target
Sphingosine 1-phosphate receptor 4
Ligand
BDBM399291
Substrate
Meas. Tech.
TBD
IC50
>50000±n/a nM
Citation
 Roberts, ERosen, HUrbano, MGuerrero, MA Sphinogosine-1-phosphate receptor modulators for treatment of cardiopulmonary disorders US Patent  US10323029 Publication Date 6/18/2019 
Target
Name:
Sphingosine 1-phosphate receptor 4
Synonyms:
EDG6 S1P receptor 4 S1P4 S1PR4_HUMAN Sphingosine 1-phosphate receptor Edg-6 sphingosine-1-phosphate 4 S1P4
Type:
G Protein-Coupled Receptor (GPCR)
Mol. Mass.:
41647.39
Organism:
Homo sapiens (Human)
Description:
Residue:
384
  
Inhibitor
Name:
BDBM399291
Synonyms:
US10323029, Generic formula 52597 IB | US11034691, CYM generic formula 52597 IB
Type:
Small organic molecule
Emp. Form.:
C20H14Cl3FN2O
Mol. Mass.:
423.695
SMILES:
Cc1cc(ccc1Cl)C(=O)N[C@@H](c1ccc(Cl)cc1)c1ncc(Cl)cc1F
: