Target
Sphingosine 1-phosphate receptor 1
Ligand
BDBM399298
Substrate
Meas. Tech.
TBD
IC50
99.0±n/a nM
Citation
 Roberts, ERosen, HUrbano, MGuerrero, MA Sphinogosine-1-phosphate receptor modulators for treatment of cardiopulmonary disorders US Patent  US10323029 Publication Date 6/18/2019 
Target
Name:
Sphingosine 1-phosphate receptor 1
Synonyms:
CHEDG1 Endothelial differentiation G-protein coupled receptor 1 S1P1 S1PR1_HUMAN Sphingosine 1-phosphate receptor Edg-1
Type:
Enzyme
Mol. Mass.:
42836.02
Organism:
Homo sapiens (Human)
Description:
P21453
Residue:
382
  
Inhibitor
Name:
BDBM399298
Synonyms:
US10323029, Generic formula 52604 IB | US11034691, CYM generic formula 52604 IB
Type:
Small organic molecule
Emp. Form.:
C21H11BrCl2N4O
Mol. Mass.:
486.148
SMILES:
Clc1ccc(cc1Cl)[C@H](NC(=O)c1ccc(C#N)c(c1)C#N)c1ccc(Br)cn1
: