Target
Genome polyprotein [1517-1688]/Mastoparan-2 [1420-1466]
Ligand
BDBM33249
Substrate
BDBM33248
Meas. Tech.
WNV Protease Inhibition Assay
pH
8.5±n/a
Temperature
310.15±n/a K
IC50
34200±100 nM
Citation
 Ekonomiuk, DSu, XCOzawa, KBodenreider, CLim, SPOtting, GHuang, DCaflisch, A Flaviviral protease inhibitors identified by fragment-based library docking into a structure generated by molecular dynamics. J Med Chem 52:4860-8 (2009)  
Target
Name:
Genome polyprotein [1517-1688]/Mastoparan-2 [1420-1466]
Synonyms:
West Nile Virus (WNV) NS2B-NS3 Protease
Type:
Cofactor/Enzyme
Mol. Mass.:
Description:
Components:
This complex has 2 components.
Component 1
Name:
Mastoparan-2 [1420-1466]
Synonyms:
Flavivirin protease NS2B regulatory subunit NS2B
Type:
Cofactor Domain
Mol. Mass.:
6087.97
Organism:
West Nile virus (WNV)
Description:
P69035[1420-1466]
Residue:
54
  
Component 2
Name:
Genome polyprotein [1517-1688]
Synonyms:
Flavivirin protease NS3 catalytic subunit POLG_WNV
Type:
Catalytic Subunit
Mol. Mass.:
18566.91
Organism:
West Nile virus (WNV)
Description:
P06935[1517-1688]
Residue:
172
  
Inhibitor
Name:
BDBM33249
Synonyms:
4-nitrophenyl 4-carbamimidamidobenzoate, 2
Type:
Small organic molecule
Emp. Form.:
C14H12N4O4
Mol. Mass.:
300.2695
SMILES:
N\C([NH-])=[NH+]\c1ccc(cc1)C(=O)Oc1ccc(cc1)[N+]([O-])=O
:
Substrate
Name:
BDBM33248
Synonyms:
Bz-Nle-Lys-Arg-Arg-AMC benzoyl-Nle-Lys-Arg-Arg-7-amido-4-methylcoumarin
Type:
fluorogenic tetrapeptide substrate
Emp. Form.:
Mol. Mass.:
SMILES:
: