Target
Sortase family protein
Ligand
BDBM33314
Substrate
BDBM33299
Meas. Tech.
Fluorescence Resonance Energy Transfer (FRET) Assay
pH
7.5±n/a
Temperature
298.15±n/a K
IC50
200±60 nM
Citation
 Suree, NYi, SWThieu, WMarohn, MDamoiseaux, RChan, AJung, MEClubb, RT Discovery and structure-activity relationship analysis of Staphylococcus aureus sortase A inhibitors. Bioorg Med Chem 17:7174-85 (2009)  
Target
Name:
Sortase family protein
Synonyms:
Sortase | Sortase A (SrtA)
Type:
Enzyme
Mol. Mass.:
23546.15
Organism:
Staphylococcus aureus
Description:
Residue:
206
  
Inhibitor
Name:
BDBM33314
Synonyms:
pyridazinone, 2-1 | pyridazinone, 2-10
Type:
Small organic molecule
Emp. Form.:
C12H12N2O2S
Mol. Mass.:
248.301
SMILES:
CCOc1c(S)cnn(-c2ccccc2)c1=O
:
Substrate
Name:
BDBM33299
Synonyms:
Abz-LPETG-Dap(Dnp) | o-aminobenzoyl (Abz)-LPETG-diaminopropionic acid-dinitrophenyl- NH2
Type:
internally quenched fluorescent substrate
Emp. Form.:
Mol. Mass.:
SMILES:
: