Target
Sortase family protein
Ligand
BDBM33374
Substrate
BDBM33299
Meas. Tech.
Fluorescence Resonance Energy Transfer (FRET) Assay
IC50
300±n/a nM
Citation
 Suree, NYi, SWThieu, WMarohn, MDamoiseaux, RChan, AJung, MEClubb, RT Discovery and structure-activity relationship analysis of Staphylococcus aureus sortase A inhibitors. Bioorg Med Chem 17:7174-85 (2009)  
Target
Name:
Sortase family protein
Synonyms:
Sortase | Sortase A (SrtA)
Type:
Enzyme
Mol. Mass.:
23546.15
Organism:
Staphylococcus aureus
Description:
Residue:
206
  
Inhibitor
Name:
BDBM33374
Synonyms:
pyrazolethione, 3-12
Type:
Small organic molecule
Emp. Form.:
C17H12Br3N3S
Mol. Mass.:
530.074
SMILES:
Cc1[nH]n(-c2ccccc2)c(=S)c1C=Nc1c(Br)cc(Br)cc1Br
:
Substrate
Name:
BDBM33299
Synonyms:
Abz-LPETG-Dap(Dnp) | o-aminobenzoyl (Abz)-LPETG-diaminopropionic acid-dinitrophenyl- NH2
Type:
internally quenched fluorescent substrate
Emp. Form.:
Mol. Mass.:
SMILES:
: