Target
Sortase family protein
Ligand
BDBM33379
Substrate
BDBM33299
Meas. Tech.
Fluorescence Resonance Energy Transfer (FRET) Assay
IC50
760±n/a nM
Citation
 Suree, NYi, SWThieu, WMarohn, MDamoiseaux, RChan, AJung, MEClubb, RT Discovery and structure-activity relationship analysis of Staphylococcus aureus sortase A inhibitors. Bioorg Med Chem 17:7174-85 (2009)  
Target
Name:
Sortase family protein
Synonyms:
Sortase | Sortase A (SrtA)
Type:
Enzyme
Mol. Mass.:
23546.15
Organism:
Staphylococcus aureus
Description:
Residue:
206
  
Inhibitor
Name:
BDBM33379
Synonyms:
pyrazolethione, 3-17
Type:
Small organic molecule
Emp. Form.:
C16H14N4S
Mol. Mass.:
294.374
SMILES:
Cc1[nH]n(-c2ccccc2)c(=S)c1C=Nc1ccccn1
:
Substrate
Name:
BDBM33299
Synonyms:
Abz-LPETG-Dap(Dnp) | o-aminobenzoyl (Abz)-LPETG-diaminopropionic acid-dinitrophenyl- NH2
Type:
internally quenched fluorescent substrate
Emp. Form.:
Mol. Mass.:
SMILES:
: