Target
Serine/threonine-protein kinase Chk2 [209-531,Q209M]
Ligand
BDBM34068
Substrate
Fam-CHK2tide
Meas. Tech.
IMAP High-Throughput Screening
pH
7.2±n/a
Temperature
296.15±n/a K
IC50
>20000±n/a nM
Citation
 Jobson, AGCardellina, JHScudiero, DKondapaka, SZhang, HKim, HShoemaker, RPommier, Y Identification of a Bis-guanylhydrazone [4,4'-Diacetyldiphenylurea-bis(guanylhydrazone); NSC 109555] as a novel chemotype for inhibition of Chk2 kinase. Mol Pharmacol 72:876-84 (2007)  
Target
Name:
Serine/threonine-protein kinase Chk2 [209-531,Q209M]
Synonyms:
CDS1 CHK2 Checkpoint Kinase (Chk2) RAD53
Type:
Serine/threonine-protein kinase
Mol. Mass.:
36511.81
Organism:
Homo sapiens (Human)
Description:
O96017[209-531,Q209M]
Residue:
323
  
Inhibitor
Name:
BDBM34068
Synonyms:
NSC 69432 (MGBG)
Type:
Small organic molecule
Emp. Form.:
C5H12N8
Mol. Mass.:
184.2024
SMILES:
[#6]-[#6](-[#6]=[#7]\[#7]=[#6](/[#7])-[#7])=[#7]-[#7]-[#6](-[#7])=[#7]
:
Substrate
Name:
Fam-CHK2tide
Synonyms:
Type:
fluorescent-labeled peptide
Mol. Mass.:
2356.22
Organism:
Description:
Residue:
19
FAMAMRLERQDSIFYPKNH