Target
Beta-lactamase CTX-M-1
Ligand
BDBM36440
Substrate
Meas. Tech.
Beta-lactamase CTX-M Inhibition Assay
pH
7±0
Ki
1300000±0.0 nM
Citation
 Chen, YShoichet, BK Molecular docking and ligand specificity in fragment-based inhibitor discovery. Nat Chem Biol 5:358-64 (2009)  
Target
Name:
Beta-lactamase CTX-M-1
Synonyms:
BLC1_ECOLX bla men1
Type:
Protien
Mol. Mass.:
31251.38
Organism:
Escherichia coli
Description:
Q7AVW6
Residue:
291
  
Inhibitor
Name:
BDBM36440
Synonyms:
CID25181259 | ZINC13785333, 4
Type:
Small organic molecule
Emp. Form.:
C12H14NO4
Mol. Mass.:
236.2444
SMILES:
C[C@H](N1C(=O)C2C3CCC(C3)C2C1=O)C([O-])=O
: