Target
Beta-lactamase CTX-M-1
Ligand
BDBM36445
Substrate
Meas. Tech.
Beta-lactamase CTX-M Inhibition Assay
pH
7±0
Ki
1000000±0.0 nM
Citation
 Chen, YShoichet, BK Molecular docking and ligand specificity in fragment-based inhibitor discovery. Nat Chem Biol 5:358-64 (2009)  
Target
Name:
Beta-lactamase CTX-M-1
Synonyms:
BLC1_ECOLX bla men1
Type:
Protien
Mol. Mass.:
31251.38
Organism:
Escherichia coli
Description:
Q7AVW6
Residue:
291
  
Inhibitor
Name:
BDBM36445
Synonyms:
CID7010321 | ZINC02389418, 9
Type:
Small organic molecule
Emp. Form.:
C14H11N4O
Mol. Mass.:
251.2639
SMILES:
C(Oc1cccc(c1)-c1nn[n-]n1)c1ccccc1
: