Target
Thyroid hormone receptor alpha
Ligand
BDBM36487
Substrate
Meas. Tech.
Transactivation Assay in HeLa cells
EC50
11±1 nM
Citation
 Ocasio, CAScanlan, TS Design and characterization of a thyroid hormone receptor alpha (TRalpha)-specific agonist. ACS Chem Biol 1:585-93 (2006)  
Target
Name:
Thyroid hormone receptor alpha
Synonyms:
C-erbA-alpha EAR7 NR1A1 THA_HUMAN THRA1 Thyroid Hormone Receptor (TR-alpha) Thyroid hormone receptor alpha c-erbA-1
Type:
Receptor
Mol. Mass.:
54818.00
Organism:
Homo sapiens (Human)
Description:
Recombinant hThR was obtained from nuclear extracts from SF9 cells infected with baculovirus vectors encoding for ThRalpha 1.
Residue:
490
  
Inhibitor
Name:
BDBM36487
Synonyms:
CHEMBL263630 | CO23
Type:
Small organic molecule
Emp. Form.:
C19H18I2N2O4
Mol. Mass.:
592.1662
SMILES:
CC(C)c1cc(Oc2c(I)cc(Cc3[nH]c(=O)[nH]c3O)cc2I)ccc1O
: