Target
Farnesyl pyrophosphate synthase
Ligand
BDBM36501
Substrate
BDBM36499
Meas. Tech.
Biophysical assay
pH
7.4±0
Temperature
296.15±0 K
IC50
>5.00e+5±n/a nM
Citation
 Jahnke, WRondeau, JMCotesta, SMarzinzik, APellé, XGeiser, MStrauss, AGötte, MBitsch, FHemmig, RHenry, CLehmann, SGlickman, JFRoddy, TPStout, SJGreen, JR Allosteric non-bisphosphonate FPPS inhibitors identified by fragment-based discovery. Nat Chem Biol 6:660-6 (2010)  
Target
Name:
Farnesyl pyrophosphate synthase
Synonyms:
Dimethylallyltranstransferase FPP synthase FPPS_HUMAN Farnesyl diphosphate synthase Farnesyl diphosphate synthetase Farnesyl pyrophosphate synthetase KIAA1293 | P14324
Type:
Enzyme
Mol. Mass.:
48272.89
Organism:
Homo sapiens (Human)
Description:
P14324
Residue:
419
  
Inhibitor
Name:
BDBM36501
Synonyms:
2-(5-chloro-3-methylbenzo[b]thiophen-2-yl)acetic acid, 2 | CID68686
Type:
Small organic molecule
Emp. Form.:
C11H9ClO2S
Mol. Mass.:
240.706
SMILES:
Cc1c(CC(O)=O)sc2ccc(Cl)cc12
:
Substrate
Name:
BDBM36499
Synonyms:
DMAPP | Dimethylallyl pyrophosphate
Type:
Substrate
Emp. Form.:
C5H9O6P2
Mol. Mass.:
227.0705
SMILES:
[#6]\[#6](-[#6])=[#6]\[#6]-[#8]P([#8-])(=O)P([#8-])([#8-])=O
: