Target
Farnesyl pyrophosphate synthase
Ligand
BDBM36506
Substrate
BDBM36499
Meas. Tech.
Biophysical assay
pH
7.4±0
Temperature
296.15±0 K
IC50
7e+3±n/a nM
Citation
 Jahnke, WRondeau, JMCotesta, SMarzinzik, APellé, XGeiser, MStrauss, AGötte, MBitsch, FHemmig, RHenry, CLehmann, SGlickman, JFRoddy, TPStout, SJGreen, JR Allosteric non-bisphosphonate FPPS inhibitors identified by fragment-based discovery. Nat Chem Biol 6:660-6 (2010)  
Target
Name:
Farnesyl pyrophosphate synthase
Synonyms:
Dimethylallyltranstransferase FPP synthase FPPS_HUMAN Farnesyl diphosphate synthase Farnesyl diphosphate synthetase Farnesyl pyrophosphate synthetase KIAA1293 | P14324
Type:
Enzyme
Mol. Mass.:
48272.89
Organism:
Homo sapiens (Human)
Description:
P14324
Residue:
419
  
Inhibitor
Name:
BDBM36506
Synonyms:
2-(Naphtho[2,1-b]thiophen-1-yl)acetic acid, 7 | CID46398844
Type:
Small organic molecule
Emp. Form.:
C14H10O2S
Mol. Mass.:
242.293
SMILES:
OC(=O)Cc1csc2ccc3ccccc3c12
:
Substrate
Name:
BDBM36499
Synonyms:
DMAPP | Dimethylallyl pyrophosphate
Type:
Substrate
Emp. Form.:
C5H9O6P2
Mol. Mass.:
227.0705
SMILES:
[#6]\[#6](-[#6])=[#6]\[#6]-[#8]P([#8-])(=O)P([#8-])([#8-])=O
: