Target
Farnesyl pyrophosphate synthase
Ligand
BDBM36507
Substrate
BDBM36499
Meas. Tech.
Biophysical assay
pH
7.4±0
Temperature
296.15±0 K
IC50
5.0e+4±n/a nM
Citation
 Jahnke, WRondeau, JMCotesta, SMarzinzik, APellé, XGeiser, MStrauss, AGötte, MBitsch, FHemmig, RHenry, CLehmann, SGlickman, JFRoddy, TPStout, SJGreen, JR Allosteric non-bisphosphonate FPPS inhibitors identified by fragment-based discovery. Nat Chem Biol 6:660-6 (2010)  
Target
Name:
Farnesyl pyrophosphate synthase
Synonyms:
Dimethylallyltranstransferase FPP synthase FPPS_HUMAN Farnesyl diphosphate synthase Farnesyl diphosphate synthetase Farnesyl pyrophosphate synthetase KIAA1293 | P14324
Type:
Enzyme
Mol. Mass.:
48272.89
Organism:
Homo sapiens (Human)
Description:
P14324
Residue:
419
  
Inhibitor
Name:
BDBM36507
Synonyms:
(R)-1-(benzyloxycarbonyl)indoline-2-carboxylic acid, 8 | CID6932062
Type:
Small organic molecule
Emp. Form.:
C17H15NO4
Mol. Mass.:
297.3053
SMILES:
OC(=O)[C@H]1Cc2ccccc2N1C(=O)OCc1ccccc1
:
Substrate
Name:
BDBM36499
Synonyms:
DMAPP | Dimethylallyl pyrophosphate
Type:
Substrate
Emp. Form.:
C5H9O6P2
Mol. Mass.:
227.0705
SMILES:
[#6]\[#6](-[#6])=[#6]\[#6]-[#8]P([#8-])(=O)P([#8-])([#8-])=O
: