Target
Farnesyl pyrophosphate synthase
Ligand
BDBM36508
Substrate
BDBM36499
Meas. Tech.
Biophysical assay
pH
7.4±0
Temperature
296.15±0 K
IC50
2e+3±n/a nM
Citation
 Jahnke, WRondeau, JMCotesta, SMarzinzik, APellé, XGeiser, MStrauss, AGötte, MBitsch, FHemmig, RHenry, CLehmann, SGlickman, JFRoddy, TPStout, SJGreen, JR Allosteric non-bisphosphonate FPPS inhibitors identified by fragment-based discovery. Nat Chem Biol 6:660-6 (2010)  
Target
Name:
Farnesyl pyrophosphate synthase
Synonyms:
Dimethylallyltranstransferase FPP synthase FPPS_HUMAN Farnesyl diphosphate synthase Farnesyl diphosphate synthetase Farnesyl pyrophosphate synthetase KIAA1293 | P14324
Type:
Enzyme
Mol. Mass.:
48272.89
Organism:
Homo sapiens (Human)
Description:
P14324
Residue:
419
  
Inhibitor
Name:
BDBM36508
Synonyms:
3-(Carboxymethyl)-4,7-dichloro-1H-indole-2-carboxylic acid, 9 | CID46398841
Type:
Small organic molecules
Emp. Form.:
C11H7Cl2NO4
Mol. Mass.:
288.084
SMILES:
OC(=O)Cc1c([nH]c2c(Cl)ccc(Cl)c12)C(O)=O
:
Substrate
Name:
BDBM36499
Synonyms:
DMAPP | Dimethylallyl pyrophosphate
Type:
Substrate
Emp. Form.:
C5H9O6P2
Mol. Mass.:
227.0705
SMILES:
[#6]\[#6](-[#6])=[#6]\[#6]-[#8]P([#8-])(=O)P([#8-])([#8-])=O
: