Target
Beta-lactamase
Ligand
BDBM39811
Substrate
Meas. Tech.
Enzyme Inhibition Assay
pH
7±0
Ki
3.0e+2±n/a nM
Citation
 Caselli, EPowers, RABlasczcak, LCWu, CYPrati, FShoichet, BK Energetic, structural, and antimicrobial analyses of beta-lactam side chain recognition by beta-lactamases. Chem Biol 8:17-31 (2001)  
Target
Name:
Beta-lactamase
Synonyms:
AMPC_ECOLI Beta-lactamase (AmpC) Cephalosporinase ampA | ampC
Type:
Protien
Mol. Mass.:
41561.62
Organism:
Escherichia coli
Description:
P00811
Residue:
377
  
Inhibitor
Name:
BDBM39811
Synonyms:
Acylglycineboronic acid, 8
Type:
Small organic molecule
Emp. Form.:
C10H14BNO4
Mol. Mass.:
223.033
SMILES:
CC(Oc1ccccc1)C(=O)NCB(O)O
: