Target
Beta-lactamase
Ligand
BDBM39854
Substrate
Meas. Tech.
Inhibition Assay
pH
7±0
Ki
7.7e+2±n/a nM
Citation
 Tondi, DPowers, RACaselli, ENegri, MCBlázquez, JCosti, MPShoichet, BK Structure-based design and in-parallel synthesis of inhibitors of AmpC beta-lactamase. Chem Biol 8:593-611 (2001)  
Target
Name:
Beta-lactamase
Synonyms:
AMPC_ECOLI Beta-lactamase (AmpC) Cephalosporinase ampA | ampC
Type:
Protien
Mol. Mass.:
41561.62
Organism:
Escherichia coli
Description:
P00811
Residue:
377
  
Inhibitor
Name:
BDBM39854
Synonyms:
Amide and sulfonamide derivatives, 38
Type:
Small organic molecule
Emp. Form.:
C12H11BN2O6S
Mol. Mass.:
322.102
SMILES:
OB(O)c1cccc(NS(=O)(=O)c2ccc(cc2)N(=O)=O)c1
: