Target
Glycylpeptide N-tetradecanoyltransferase
Ligand
BDBM50121720
Substrate
BDBM43857
Meas. Tech.
Inhibition Assay
IC50
1±n/a nM
Citation
 Sogabe, SMasubuchi, MSakata, KFukami, TAMorikami, KShiratori, YEbiike, HKawasaki, KAoki, YShimma, ND'Arcy, AWinkler, FKBanner, DWOhtsuka, T Crystal structures of Candida albicans N-myristoyltransferase with two distinct inhibitors. Chem Biol 9:1119-28 (2002)  
Target
Name:
Glycylpeptide N-tetradecanoyltransferase
Synonyms:
2.3.1.97 Myristoyl-CoA:protein N-myristoyltransferase Myristoyl-CoA:protein N-myristoyltransferase (Nmt D112A)) Myristoyl-CoA:protein N-myristoyltransferase (Nmt F115A)) Myristoyl-CoA:protein N-myristoyltransferase (Nmt F240A)) Myristoyl-CoA:protein N-myristoyltransferase (Nmt F339S)) Myristoyl-CoA:protein N-myristoyltransferase (Nmt H227A)) Myristoyl-CoA:protein N-myristoyltransferase (Nmt I352A)) Myristoyl-CoA:protein N-myristoyltransferase (Nmt L451A)) Myristoyl-CoA:protein N-myristoyltransferase (Nmt N175A)) Myristoyl-CoA:protein N-myristoyltransferase (Nmt S241A)) Myristoyl-CoA:protein N-myristoyltransferase (Nmt T211A)) Myristoyl-CoA:protein N-myristoyltransferase (Nmt W232A)) Myristoyl-CoA:protein N-myristoyltransferase (Nmt Y119A)) Myristoyl-CoA:protein N-myristoyltransferase (Nmt Y256A)) Myristoyl-CoA:protein N-myristoyltransferase (Nmt) NMT1 Peptide N-myristoyltransferase | Peptide N-myristoyltransferase 1
Type:
Enzyme
Mol. Mass.:
51875.96
Organism:
Candida albicans (Yeast)
Description:
P30418
Residue:
451
  
Inhibitor
Name:
BDBM50121720
Synonyms:
(1-METHYL-1H-IMIDAZOL-2-YL)-(3-METHYL-4-{3-[(PYRIDIN-3-YLMETHYL)-AMINO]-PROPOXY}-BENZOFURAN-2-YL)-METHANONE Non peptidic, 5
Type:
Small organic molecule
Emp. Form.:
C23H24N4O3
Mol. Mass.:
404.4617
SMILES:
Cc1c(oc2cccc(OCCCNCc3cccnc3)c12)C(=O)c1nccn1C
:
Substrate
Name:
BDBM43857
Synonyms:
2-[ethyl-[(4-keto-1H-quinazolin-2-yl)methyl]amino]-N-[2-(4-fluorophenyl)ethyl]acetamide 2-[ethyl-[(4-oxo-1H-quinazolin-2-yl)methyl]amino]-N-[2-(4-fluorophenyl)ethyl]acetamide MLS000760541 cid_16196545
Type:
Peptide
Emp. Form.:
C21H23FN4O2
Mol. Mass.:
382.4313
SMILES:
CCN(CC(=O)NCCc1ccc(F)cc1)Cc1nc2ccccc2c(=O)[nH]1
: