Target
Zinc finger protein mex-5
Ligand
BDBM33071
Substrate
Meas. Tech.
Fluorescent Polarization Homogeneous Dose Response HTS to Indentify Inhibitors of Mex-5 Binding to TCR-2
EC50
17546±n/a nM
Citation
 PubChem, PC Fluorescent Polarization Homogeneous Dose Response HTS to Indentify Inhibitors of Mex-5 Binding to TCR-2 PubChem Bioassay (2009)[AID] 
Target
Name:
Zinc finger protein mex-5
Synonyms:
MEX5_CAEEL mex-5
Type:
Enzyme Catalytic Domain
Mol. Mass.:
52832.78
Organism:
Caenorhabditis elegans
Description:
gi_55976631
Residue:
468
  
Inhibitor
Name:
BDBM33071
Synonyms:
2,3-Di-furan-2-yl-quinoxaline-6-carboxylic acid (2-hydroxy-ethyl)-amide 2,3-bis(2-furyl)-N-(2-hydroxyethyl)quinoxaline-6-carboxamide MLS000529296 cid_3157644
Type:
Small organic molecule
Emp. Form.:
C19H15N3O4
Mol. Mass.:
349.3401
SMILES:
OCCNC(=O)c1ccc2nc(-c3ccco3)c(nc2c1)-c1ccco1
: