Target
Neutrophil cytosol factor 1 [S99G]
Ligand
BDBM40512
Substrate
Meas. Tech.
Dose Response Confirmation for small molecular inhibitors for p47phox, a regulatory protein of NADPH oxidases (Noxs)
IC50
50000±n/a nM
Citation
 PubChem, PC Dose Response Confirmation for small molecular inhibitors for p47phox, a regulatory protein of NADPH oxidases (Noxs) PubChem Bioassay (2008)[AID] 
Target
Name:
Neutrophil cytosol factor 1 [S99G]
Synonyms:
NCF1 NOXO2 neutrophil cytosolic factor 1
Type:
Enzyme Catalytic Domain
Mol. Mass.:
44664.39
Organism:
Homo sapiens (Human)
Description:
gi_115298672
Residue:
390
  
Inhibitor
Name:
BDBM40512
Synonyms:
2-({3-[2-(3,4-dimethoxyphenyl)ethyl]-4-oxo-3,4-dihydrothieno[3,2-d]pyrimidin-2-yl}thio)-N-(5-methylisoxazol-3-yl)acetamide 2-[3-[2-(3,4-dimethoxyphenyl)ethyl]-4-oxidanylidene-thieno[3,2-d]pyrimidin-2-yl]sulfanyl-N-(5-methyl-1,2-oxazol-3-yl)ethanamide 2-[[3-[2-(3,4-dimethoxyphenyl)ethyl]-4-oxo-2-thieno[3,2-d]pyrimidinyl]thio]-N-(5-methyl-3-isoxazolyl)acetamide SMR000031125 | cid_3242940
Type:
Small organic molecule
Emp. Form.:
C22H22N4O5S2
Mol. Mass.:
486.564
SMILES:
COc1ccc(CCn2c(SCC(=O)Nc3cc(C)on3)nc3ccsc3c2=O)cc1OC
: