Target
4-hydroxy-tetrahydrodipicolinate reductase
Ligand
BDBM59098
Substrate
Meas. Tech.
Steady-State Inhibition Assay
pH
7.4±0
Ki
26±0.0 nM
Citation
 Sem, DSBertolaet, BBaker, BChang, ECostache, ADCoutts, SDong, QHansen, MHong, VHuang, XJack, RMKho, RLang, HMa, CTMeininger, DPellecchia, MPierre, FVillar, HYu, L Systems-based design of bi-ligand inhibitors of oxidoreductases: filling the chemical proteomic toolbox. Chem Biol 11:185-94 (2004)  
Target
Name:
4-hydroxy-tetrahydrodipicolinate reductase
Synonyms:
DAPB_ECOLI dapB
Type:
Enzyme
Mol. Mass.:
28751.25
Organism:
Escherichia coli
Description:
P04036
Residue:
273
  
Inhibitor
Name:
BDBM59098
Synonyms:
Bi-ligand, 1
Type:
Small organic molecule
Emp. Form.:
C12H8NO5S2
Mol. Mass.:
310.326
SMILES:
Oc1ccc(\C=C2/SC(=S)N(CC([O-])=O)C2=O)cc1O
: