Target
Gag-Pol polyprotein [588-1027]/[588-1147]
Ligand
BDBM2405
Substrate
poly(rC)-oligo(dG)(12-18)
Meas. Tech.
HIV-1 RT Assay
pH
7.8±n/a
Temperature
310.15±n/a K
IC50
500±n/a nM
Citation
 Artico, MSilvestri, RPagnozzi, EBruno, BNovellino, EGreco, GMassa, SEttorre, ALoi, AGScintu, FLa Colla, P Structure-based design, synthesis, and biological evaluation of novel pyrrolyl aryl sulfones: HIV-1 non-nucleoside reverse transcriptase inhibitors active at nanomolar concentrations. J Med Chem 43:1886-91 (2000)  
Target
Name:
Gag-Pol polyprotein [588-1027]/[588-1147]
Synonyms:
EC: 2.7.7.49 | HIV-1 Reverse Transcriptase
Type:
Protein Complex
Mol. Mass.:
115684
Description:
Components:
This complex has 2 components.
Component 1
Name:
Gag-Pol polyprotein [588-1147]
Synonyms:
HIV-1 Reverse Transcriptase Chain A gag-pol
Type:
Enzyme Subunit
Mol. Mass.:
64486.41
Organism:
Human immunodeficiency virus type 1
Description:
P04585[588-1147]
Residue:
560
  
Component 2
Name:
Gag-Pol polyprotein [588-1027]
Synonyms:
HIV-1 Reverse Transcriptase Chain B gag-pol
Type:
Enzyme Subunit
Mol. Mass.:
51337.13
Organism:
Human immunodeficiency virus type 1
Description:
P04585[588-1027]
Residue:
440
  
Inhibitor
Name:
BDBM2405
Synonyms:
Pyrrolyl Aryl Sulfone (PAS) 26 | ethyl 1-[(2-amino-5-chlorobenzene)sulfonyl]-4-[(phenylamino)methyl]-1H-pyrrole-2-carboxylate
Type:
Small organic molecule
Emp. Form.:
C20H20ClN3O4S
Mol. Mass.:
433.908
SMILES:
CCOC(=O)c1cc(CNc2ccccc2)cn1S(=O)(=O)c1cc(Cl)ccc1N
:
Substrate
Name:
poly(rC)-oligo(dG)(12-18)
Synonyms:
Type:
RNA/DNA duplex
Mol. Mass.:
358.43
Organism:
Description:
The incorporation of Tritium-labeled dGTP onto a poly(rC)-oligo(dG)(12-18) template-primer
Residue:
3
NA