Target
Orexin receptor type 2
Ligand
BDBM404257
Substrate
Meas. Tech.
FLIPR Ca2+ Flux Assay
IC50
104±n/a nM
Citation
 Liverton, NKuduk, SDBeshore, DLuo, YMeng, NYu, T Piperidine isoxazole and isothiazole orexin receptor antagonists US Patent  US10017504 Publication Date 7/10/2018 
Target
Name:
Orexin receptor type 2
Synonyms:
HCRTR2 OX2R_HUMAN Orexin receptor type 2 (OR-2) Orexin receptor type 2 (OX2R) Ox-2-R | Ox2-R
Type:
Protein
Mol. Mass.:
50710.53
Organism:
Homo sapiens (Human)
Description:
O43614
Residue:
444
  
Inhibitor
Name:
BDBM404257
Synonyms:
(1-(2-((2R,5R)-5-(5-(2-Hydroxypropan-2-yl)isoxazol-3-yl)-2-methylpiperidine-1-carbonyl)phenyl)cyclopropanecarbonitrile) | US10017504, 2
Type:
Small organic molecule
Emp. Form.:
C23H27N3O3
Mol. Mass.:
393.4788
SMILES:
C[C@@H]1CC[C@H](CN1C(=O)c1ccccc1C1(CC1)C#N)c1cc(on1)C(C)(C)O
: