Target
Orexin receptor type 2
Ligand
BDBM404302
Substrate
Meas. Tech.
FLIPR Ca2+ Flux Assay
IC50
134±n/a nM
Citation
 Liverton, NKuduk, SDBeshore, DLuo, YMeng, NYu, T Piperidine isoxazole and isothiazole orexin receptor antagonists US Patent  US10017504 Publication Date 7/10/2018 
Target
Name:
Orexin receptor type 2
Synonyms:
HCRTR2 OX2R_HUMAN Orexin receptor type 2 (OR-2) Orexin receptor type 2 (OX2R) Ox-2-R | Ox2-R
Type:
Protein
Mol. Mass.:
50710.53
Organism:
Homo sapiens (Human)
Description:
O43614
Residue:
444
  
Inhibitor
Name:
BDBM404302
Synonyms:
2-(5-{(3R,6R)-6-Methyl-1-[(2- phenylpyridin-3- yl)carbonyl]piperidin-3- yl}isoxazol-3-yl)propan-2-ol | US10017504, 33
Type:
Small organic molecule
Emp. Form.:
C24H27N3O3
Mol. Mass.:
405.4895
SMILES:
C[C@@H]1CC[C@H](CN1C(=O)c1cccnc1-c1ccccc1)c1cc(no1)C(C)(C)O
: