Target
Orexin receptor type 2
Ligand
BDBM404320
Substrate
Meas. Tech.
FLIPR Ca2+ Flux Assay
IC50
146±n/a nM
Citation
 Liverton, NKuduk, SDBeshore, DLuo, YMeng, NYu, T Piperidine isoxazole and isothiazole orexin receptor antagonists US Patent  US10017504 Publication Date 7/10/2018 
Target
Name:
Orexin receptor type 2
Synonyms:
HCRTR2 OX2R_HUMAN Orexin receptor type 2 (OR-2) Orexin receptor type 2 (OX2R) Ox-2-R | Ox2-R
Type:
Protein
Mol. Mass.:
50710.53
Organism:
Homo sapiens (Human)
Description:
O43614
Residue:
444
  
Inhibitor
Name:
BDBM404320
Synonyms:
((1S)-2,2,2-Trifluoro-1-(5-{(3R,6R)-6-methyl-1-[(2-pyrimidin-2-ylphenyl)carbonyl]piperidin-3-yl}isoxazol-3-yl)ethanol) | US10017504, 51
Type:
Small organic molecule
Emp. Form.:
C22H21F3N4O3
Mol. Mass.:
446.4223
SMILES:
C[C@@H]1CC[C@H](CN1C(=O)c1ccccc1-c1ncccn1)c1cc(no1)[C@H](O)C(F)(F)F
: