Target
Orexin receptor type 2
Ligand
BDBM404321
Substrate
Meas. Tech.
FLIPR Ca2+ Flux Assay
IC50
47.3±n/a nM
Citation
 Liverton, NKuduk, SDBeshore, DLuo, YMeng, NYu, T Piperidine isoxazole and isothiazole orexin receptor antagonists US Patent  US10017504 Publication Date 7/10/2018 
Target
Name:
Orexin receptor type 2
Synonyms:
HCRTR2 OX2R_HUMAN Orexin receptor type 2 (OR-2) Orexin receptor type 2 (OX2R) Ox-2-R | Ox2-R
Type:
Protein
Mol. Mass.:
50710.53
Organism:
Homo sapiens (Human)
Description:
O43614
Residue:
444
  
Inhibitor
Name:
BDBM404321
Synonyms:
(1-Cyclopropyl-1-{5-[(3R,6R)-6-methyl-1-{[2-(2H-1,2,3-triazol-2-yl)phenyl]carbonyl}piperidin-3-yl]isoxazol-3-yl}ethanol) (Ex. 52) and (1-Cyclopropyl-1-{5-[(3R,6R)-6-methyl-1-{[2-(2H-1,2,3-triazol-2-yl)phenyl]carbonyl}piperidin-3-yl]isoxazol-3-yl}ethanol) (Ex. 53) | US10017504, 52
Type:
Small organic molecule
Emp. Form.:
C21H24N6O4
Mol. Mass.:
424.4531
SMILES:
CON(C)C(=O)c1cc(on1)[C@@H]1CC[C@@H](C)N(C1)C(=O)c1ccccc1-n1nccn1
: