Target
Orexin receptor type 2
Ligand
BDBM404323
Substrate
Meas. Tech.
FLIPR Ca2+ Flux Assay
IC50
76.1±n/a nM
Citation
 Liverton, NKuduk, SDBeshore, DLuo, YMeng, NYu, T Piperidine isoxazole and isothiazole orexin receptor antagonists US Patent  US10017504 Publication Date 7/10/2018 
Target
Name:
Orexin receptor type 2
Synonyms:
HCRTR2 OX2R_HUMAN Orexin receptor type 2 (OR-2) Orexin receptor type 2 (OX2R) Ox-2-R | Ox2-R
Type:
Protein
Mol. Mass.:
50710.53
Organism:
Homo sapiens (Human)
Description:
O43614
Residue:
444
  
Inhibitor
Name:
BDBM404323
Synonyms:
2-{5-[(3R,6R)-6-Methyl-1- {[2-(2H-1,2,3- triazol-2-yl)phenyl] carbonyl}piperidin-3- yl]isoxazol-3-yl}butan-2-ol US10017504, 55
Type:
Small organic molecule
Emp. Form.:
C22H27N5O3
Mol. Mass.:
409.4815
SMILES:
CCC(C)(O)c1cc(on1)[C@@H]1CC[C@@H](C)N(C1)C(=O)c1ccccc1-n1nccn1
: