Target
Orexin receptor type 2
Ligand
BDBM404335
Substrate
Meas. Tech.
FLIPR Ca2+ Flux Assay
IC50
21.1±n/a nM
Citation
 Liverton, NKuduk, SDBeshore, DLuo, YMeng, NYu, T Piperidine isoxazole and isothiazole orexin receptor antagonists US Patent  US10017504 Publication Date 7/10/2018 
Target
Name:
Orexin receptor type 2
Synonyms:
HCRTR2 OX2R_HUMAN Orexin receptor type 2 (OR-2) Orexin receptor type 2 (OX2R) Ox-2-R | Ox2-R
Type:
Protein
Mol. Mass.:
50710.53
Organism:
Homo sapiens (Human)
Description:
O43614
Residue:
444
  
Inhibitor
Name:
BDBM404335
Synonyms:
2-{3-[(3R,6R)-6-Methyl-1-{[4-(2H-1,2,3- triazol-2-yl)thiophen-3-yl]carbonyl} piperidin-3-yl]isothiazol-5- yl}propan-2-ol | US10017504, 66
Type:
Small organic molecule
Emp. Form.:
C18H21N5O2S2
Mol. Mass.:
403.522
SMILES:
CC(C)(O)c1cc(ns1)[C@@H]1CCCN(C1)C(=O)c1cscc1-n1nccn1
: