Target
Alpha-2B adrenergic receptor
Ligand
BDBM50240671
Substrate
Ki
76±n/a nM
Comments
PDSP_1862
Citation
 Blaxall, HSMurphy, TJBaker, JCRay, CBylund, DB Characterization of the alpha-2C adrenergic receptor subtype in the opossum kidney and in the OK cell line. J Pharmacol Exp Ther 259:323-9 (1991) Target
Name:
Alpha-2B adrenergic receptor
Synonyms:
ADA2B_RAT Adrenergic receptor alpha Alpha-2B adrenergic receptor Alpha-2B adrenoreceptor | adrenergic Alpha2B
Type:
Enzyme Catalytic Domain
Mol. Mass.:
50379.83
Organism:
NEONATAL RAT
Description:
adrenergic Alpha2B ADRA2B NEONATAL RAT::P19328
Residue:
453
  
Inhibitor
Name:
BDBM50240671
Synonyms:
(5-Chloro-benzo[1,2,5]thiadiazol-4-yl)-(4,5-dihydro-1H-imidazol-2-yl)-amine TIZANIDINE | Zanaflex
Type:
Small organic molecule
Emp. Form.:
C9H8ClN5S
Mol. Mass.:
253.711
SMILES:
Clc1ccc2nsnc2c1NC1=NCCN1
: